Target
Serine/threonine-protein kinase PLK1
Ligand
BDBM50175243
Substrate
Meas. Tech.
ChEMBL_328337 (CHEMBL864552)
IC50
16000±n/a nM
Citation
 Akritopoulou-Zanze, IDarczak, DSarris, KPhelan, KMHuth, JRSong, DJohnson, EFJia, YDjuric, SW Scaffold oriented synthesis. Part 1: Design, preparation, and biological evaluation of thienopyrazoles as kinase inhibitors. Bioorg Med Chem Lett 16:96-9 (2005)  
Target
Name:
Serine/threonine-protein kinase PLK1
Synonyms:
PLK PLK1 Polo-like kinase 1 (PlK1) STPK13 Serine/threonine-protein kinase 13 | polo-like kinase
Type:
Serine/threonine-protein kinase
Mol. Mass.:
68277.16
Organism:
Homo sapiens (Human)
Description:
P53350
Residue:
603
  
Inhibitor
Name:
BDBM50175243
Synonyms:
CHEMBL373001 | N-benzyl-3-methyl-1H-thieno[2,3-c]pyrazole-5-carboxamide
Type:
Small organic molecule
Emp. Form.:
C14H13N3OS
Mol. Mass.:
271.338
SMILES:
Cc1n[nH]c2sc(cc12)C(=O)NCc1ccccc1
: