Target
5-hydroxytryptamine receptor 1A
Ligand
BDBM50175315
Substrate
Meas. Tech.
ChEMBL_328773 (CHEMBL864517)
Ki
64.9±n/a nM
Citation
 Pittalà, VRomeo, GSalerno, LSiracusa, MAModica, MMateria, LMereghetti, ICagnotto, AMennini, TMarucci, GAngeli, PRusso, F 3-Arylpiperazinylethyl-1H-pyrrolo[2,3-d]pyrimidine-2,4(3H,7H)-dione derivatives as novel, high-affinity and selective alpha(1)-adrenoceptor ligands. Bioorg Med Chem Lett 16:150-3 (2005)  
Target
Name:
5-hydroxytryptamine receptor 1A
Synonyms:
5-HT-1A 5-hydroxytryptamine receptor 1A (5-HT-1A) ADRB2RL1 Dopamine D2 receptor and serotonin 1a receptor HTR1A | Serotonin receptor 1A
Type:
Mol. Mass.:
46122.49
Organism:
Homo sapiens (Human)
Description:
Residue:
422
  
Inhibitor
Name:
BDBM50175315
Synonyms:
6-(2-chlorophenyl)-3-(2-(4-(2-chlorophenyl)piperazin-1-yl)ethyl)-1H-pyrrolo[2,3-d]pyrimidine-2,4(3H,7H)-dione | CHEMBL443567
Type:
Small organic molecule
Emp. Form.:
C24H23Cl2N5O2
Mol. Mass.:
484.378
SMILES:
Clc1ccccc1N1CCN(CCn2c(=O)[nH]c3[nH]c(cc3c2=O)-c2ccccc2Cl)CC1
: