Target
Caspase-8
Ligand
BDBM50175337
Substrate
Meas. Tech.
ChEMBL_326952 (CHEMBL853285)
IC50
4±n/a nM
Citation
 O'Neil, SVWang, YLaufersweiler, MCOppong, KASoper, DLWos, JAEllis, CDBaize, MWBosch, GKFancher, ANLu, WSuchanek, MKWang, RLDe, BDemuth, TP Synthesis and evaluation of novel 8,6-fused bicyclic peptidomimetic compounds as interleukin-1beta converting enzyme inhibitors. Bioorg Med Chem Lett 15:5434-8 (2005)  
Target
Name:
Caspase-8
Synonyms:
Apoptotic cysteine protease CAP4 CASP8 Caspase Caspase-8 subunit p18 FADD-like ICE ICE-like apoptotic protease 5 MCH5 | MORT1-associated CED-3 homolog
Type:
Enzyme
Mol. Mass.:
55373.89
Organism:
Homo sapiens (Human)
Description:
Q14790
Residue:
479
  
Inhibitor
Name:
BDBM50175337
Synonyms:
(4S,7S,11aS)-benzyl 4-(((3S)-2-hydroxy-5-oxo-tetrahydrofuran-3-yl)carbamoyl)-7-(isoquinoline-1-carboxamido)-6-oxo-3,4,7,8,11,11a-hexahydro-1H-pyrazino[1,2-a]azocine-2(6H)-carboxylate | CHEMBL199492
Type:
Small organic molecule
Emp. Form.:
C33H33N5O8
Mol. Mass.:
627.6438
SMILES:
OC1OC(=O)C[C@@H]1NC(=O)[C@@H]1CN(C[C@@H]2C\C=C/C[C@H](NC(=O)c3nccc4ccccc34)C(=O)N12)C(=O)OCc1ccccc1
: