Target
Extracellular calcium-sensing receptor
Ligand
BDBM50175365
Substrate
Meas. Tech.
ChEMBL_326645 (CHEMBL870549)
IC50
2560±n/a nM
Citation
 Gavai, AVVaz, RJMikkilineni, ABRoberge, JYLiu, YLawrence, RMCorte, JRYang, WBednarz, MDickson, JKMa, ZSeethala, RFeyen, JH Discovery of novel 1-arylmethyl pyrrolidin-2-yl ethanol amines as calcium-sensing receptor antagonists. Bioorg Med Chem Lett 15:5478-82 (2005)  
Target
Name:
Extracellular calcium-sensing receptor
Synonyms:
CASR_RAT Casr Parathyroid Cell calcium-sensing receptor | Pcar1
Type:
PROTEIN
Mol. Mass.:
120858.46
Organism:
Rattus norvegicus
Description:
ChEMBL_750426
Residue:
1079
  
Inhibitor
Name:
BDBM50175365
Synonyms:
2-fluoro-6-(((R)-2-((R)-1-hydroxy-2-(2-methyl-1-(naphthalen-2-yl)propan-2-ylamino)ethyl)pyrrolidin-1-yl)methyl)phenol | CHEMBL199495
Type:
Small organic molecule
Emp. Form.:
C27H33FN2O2
Mol. Mass.:
436.5615
SMILES:
CC(C)(Cc1ccc2ccccc2c1)NC[C@@H](O)[C@H]1CCCN1Cc1cccc(F)c1O
: