Target
Interstitial collagenase
Ligand
BDBM50175545
Substrate
Meas. Tech.
ChEMBL_320812 (CHEMBL872347)
Ki
3±n/a nM
Citation
 Alberts, ILTodorov, NPDean, PM Receptor flexibility in de novo ligand design and docking. J Med Chem 48:6585-96 (2005)  
Target
Name:
Interstitial collagenase
Synonyms:
CLG MMP1 Matrix metalloproteinase-1 | Matrix metalloproteinase-1 (MMP-1)
Type:
Enzyme
Mol. Mass.:
54010.26
Organism:
Homo sapiens (Human)
Description:
P03956
Residue:
469
  
Inhibitor
Name:
BDBM50175545
Synonyms:
CHEMBL197685 | N-Hydroxycarbamoylmethyl-4-trifluoromethyl-benzamide
Type:
Small organic molecule
Emp. Form.:
C10H9F3N2O3
Mol. Mass.:
262.1853
SMILES:
ONC(=O)CNC(=O)c1ccc(cc1)C(F)(F)F
: