Target
Mitogen-activated protein kinase 14
Ligand
BDBM50175758
Substrate
Meas. Tech.
ChEMBL_328205 (CHEMBL863917)
IC50
0.31±n/a nM
Citation
 Bao, JHunt, JAMiao, SRupprecht, KMStelmach, JELiu, LRuzek, RDSinclair, PJPivnichny, JVHop, CEKumar, SZaller, DMShoop, WLO'neill, EAO'keefe, SJThompson, CMCubbon, RMWang, RZhang, WXThompson, JEDoherty, JB p38 MAP kinase inhibitors: metabolically stabilized piperidine-substituted quinolinones and naphthyridinones. Bioorg Med Chem Lett 16:64-8 (2005)  
Target
Name:
Mitogen-activated protein kinase 14
Synonyms:
CSAID-binding protein CSBP1 CSPB1 MAP kinase 14 MAP kinase p38 alpha MAPK14 MK14_HUMAN Mitogen-activated protein kinase p38 alpha Stress-activated protein kinase 2a | p38 MAP kinase alpha/beta
Type:
Serine/threonine-protein kinase
Mol. Mass.:
41286.76
Organism:
Homo sapiens (Human)
Description:
Q16539
Residue:
360
  
Inhibitor
Name:
BDBM50175758
Synonyms:
7-(1-tert-butylpiperidin-4-yl)-5-(2-chloro-4-fluorophenyl)-1-(2,6-dichlorophenyl)quinolin-2(1H)-one | CHEMBL381632
Type:
Small organic molecule
Emp. Form.:
C30H28Cl3FN2O
Mol. Mass.:
557.914
SMILES:
CC(C)(C)N1CCC(CC1)c1cc(-c2ccc(F)cc2Cl)c2ccc(=O)n(-c3c(Cl)cccc3Cl)c2c1
: