Target
Sodium- and chloride-dependent glycine transporter 2
Ligand
BDBM50175943
Substrate
Meas. Tech.
ChEMBL_327703 (CHEMBL860256)
EC50
>100000±n/a nM
Citation
 Ceccarelli, SMPinard, EStalder, HAlberati, D Discovery of N-(2-hydroxy-2-aryl-cyclohexyl) substituted spiropiperidines as GlyT1 antagonists with improved pharmacological profile. Bioorg Med Chem Lett 16:354-7 (2005)  
Target
Name:
Sodium- and chloride-dependent glycine transporter 2
Synonyms:
GLYT2 NET1 SLC6A5 | Sodium- and chloride-dependent glycine transporter 2
Type:
Enzyme Catalytic Domain
Mol. Mass.:
87438.56
Organism:
Homo sapiens (Human)
Description:
Glycine-2-transporter 0 HUMAN::Q9Y345
Residue:
797
  
Inhibitor
Name:
BDBM50175943
Synonyms:
8-((cis, rac)-3-hydroxy-3-phenyl-tetrahydro-pyran-4-yl)-1-phenyl-1,3,8-triaza-spiro[4.5]decan-4-one | CHEMBL200053
Type:
Small organic molecule
Emp. Form.:
C24H29N3O3
Mol. Mass.:
407.5054
SMILES:
O[C@]1(COCC[C@H]1N1CCC2(CC1)N(CNC2=O)c1ccccc1)c1ccccc1
: