Target
Mu-type opioid receptor
Ligand
BDBM50175945
Substrate
Meas. Tech.
ChEMBL_327710 (CHEMBL859304)
IC50
2400±n/a nM
Citation
 Ceccarelli, SMPinard, EStalder, HAlberati, D Discovery of N-(2-hydroxy-2-aryl-cyclohexyl) substituted spiropiperidines as GlyT1 antagonists with improved pharmacological profile. Bioorg Med Chem Lett 16:354-7 (2005)  
Target
Name:
Mu-type opioid receptor
Synonyms:
M-OR-1 MOR-1 MUOR1 Mu opiate receptor OPRM1 hMOP | mu-type opioid receptor isoform MOR-1
Type:
G Protein-Coupled Receptor (GPCR)
Mol. Mass.:
44789.51
Organism:
Homo sapiens (Human)
Description:
P35372
Residue:
400
  
Inhibitor
Name:
BDBM50175945
Synonyms:
8-[(cis, rac)-2-(4-chloro-phenyl)-2-hydroxy-cyclohexyl]-1-(4-fluoro-phenyl)-1,3,8-triaza-spiro[4.5]decan-4-one | CHEMBL372567
Type:
Small organic molecule
Emp. Form.:
C25H29ClFN3O2
Mol. Mass.:
457.968
SMILES:
O[C@]1(CCCC[C@H]1N1CCC2(CC1)N(CNC2=O)c1ccc(F)cc1)c1ccc(Cl)cc1
: