Target
Mu-type opioid receptor
Ligand
BDBM50175943
Substrate
Meas. Tech.
ChEMBL_327710 (CHEMBL859304)
IC50
2500±n/a nM
Citation
 Ceccarelli, SMPinard, EStalder, HAlberati, D Discovery of N-(2-hydroxy-2-aryl-cyclohexyl) substituted spiropiperidines as GlyT1 antagonists with improved pharmacological profile. Bioorg Med Chem Lett 16:354-7 (2005)  
Target
Name:
Mu-type opioid receptor
Synonyms:
M-OR-1 MOR-1 MUOR1 Mu opiate receptor OPRM1 hMOP | mu-type opioid receptor isoform MOR-1
Type:
G Protein-Coupled Receptor (GPCR)
Mol. Mass.:
44789.51
Organism:
Homo sapiens (Human)
Description:
P35372
Residue:
400
  
Inhibitor
Name:
BDBM50175943
Synonyms:
8-((cis, rac)-3-hydroxy-3-phenyl-tetrahydro-pyran-4-yl)-1-phenyl-1,3,8-triaza-spiro[4.5]decan-4-one | CHEMBL200053
Type:
Small organic molecule
Emp. Form.:
C24H29N3O3
Mol. Mass.:
407.5054
SMILES:
O[C@]1(COCC[C@H]1N1CCC2(CC1)N(CNC2=O)c1ccccc1)c1ccccc1
: