Target
Genome polyprotein
Ligand
BDBM50175971
Substrate
Meas. Tech.
ChEMBL_328063 (CHEMBL863929)
Ki
20500±n/a nM
Citation
 Yin, ZPatel, SJWang, WLChan, WLRanga Rao, KRWang, GNgew, XPatel, VBeer, DKnox, JEMa, NLEhrhardt, CLim, SPVasudevan, SGKeller, TH Peptide inhibitors of dengue virus NS3 protease. Part 2: SAR study of tetrapeptide aldehyde inhibitors. Bioorg Med Chem Lett 16:40-3 (2005)  
Target
Name:
Genome polyprotein
Synonyms:
Dengue virus type 2 NS3 protein | POLG_DEN26
Type:
PROTEIN
Mol. Mass.:
379613.45
Organism:
Dengue virus 2
Description:
ChEMBL_328004
Residue:
3391
  
Inhibitor
Name:
BDBM50175971
Synonyms:
Bz-Nle-Lys-Arg-Lys-H | CHEMBL377076
Type:
Small organic molecule
Emp. Form.:
C31H53N9O5
Mol. Mass.:
631.8098
SMILES:
[#6]-[#6]-[#6]-[#6]-[#6@H](-[#7]-[#6](=O)-c1ccccc1)-[#6](=O)-[#7]-[#6@@H](-[#6]-[#6]-[#6]-[#6]-[#7])-[#6](=O)-[#7]-[#6@@H](-[#6]-[#6]-[#6]\[#7]=[#6](/[#7])-[#7])-[#6](=O)-[#7]-[#6@@H](-[#6]-[#6]-[#6]-[#6]-[#7])-[#6]=O
: