Target
Malonyl-CoA decarboxylase, mitochondrial
Ligand
BDBM50176153
Substrate
Meas. Tech.
ChEMBL_330757 (CHEMBL861921)
IC50
390±n/a nM
Citation
 Cheng, JFChen, MLiu, BHou, ZArrhenius, TNadzan, AM Design and synthesis of heterocyclic malonyl-CoA decarboxylase inhibitors. Bioorg Med Chem Lett 16:695-700 (2005)  
Target
Name:
Malonyl-CoA decarboxylase, mitochondrial
Synonyms:
DCMC_HUMAN Malonyl-CoA decarboxylase
Type:
PROTEIN
Mol. Mass.:
55018.37
Organism:
Homo sapiens (Human)
Description:
ChEMBL_665404
Residue:
493
  
Inhibitor
Name:
BDBM50176153
Synonyms:
CHEMBL383009 | N-(4-(4-(1,1,1,3,3,3-hexafluoro-2-hydroxypropan-2-yl)phenyl)-5-methylisoxazol-3-yl)isonicotinamide
Type:
Small organic molecule
Emp. Form.:
C19H13F6N3O3
Mol. Mass.:
445.3152
SMILES:
Cc1onc(NC(=O)c2ccncc2)c1-c1ccc(cc1)C(O)(C(F)(F)F)C(F)(F)F
: