Target
Malonyl-CoA decarboxylase, mitochondrial
Ligand
BDBM50176215
Substrate
Meas. Tech.
ChEMBL_330757 (CHEMBL861921)
IC50
3330±n/a nM
Citation
 Cheng, JFChen, MLiu, BHou, ZArrhenius, TNadzan, AM Design and synthesis of heterocyclic malonyl-CoA decarboxylase inhibitors. Bioorg Med Chem Lett 16:695-700 (2005)  
Target
Name:
Malonyl-CoA decarboxylase, mitochondrial
Synonyms:
DCMC_HUMAN Malonyl-CoA decarboxylase
Type:
PROTEIN
Mol. Mass.:
55018.37
Organism:
Homo sapiens (Human)
Description:
ChEMBL_665404
Residue:
493
  
Inhibitor
Name:
BDBM50176215
Synonyms:
2-(4-(5-amino-3-(trifluoromethyl)isoxazol-4-yl)phenyl)-1,1,1,3,3,3-hexafluoropropan-2-ol | CHEMBL201233
Type:
Small organic molecule
Emp. Form.:
C13H7F9N2O2
Mol. Mass.:
394.1925
SMILES:
Nc1onc(c1-c1ccc(cc1)C(O)(C(F)(F)F)C(F)(F)F)C(F)(F)F
: