Target
5-hydroxytryptamine receptor 2C
Ligand
BDBM50176274
Substrate
Meas. Tech.
ChEMBL_331166 (CHEMBL854093)
EC50
200±n/a nM
Citation
 Adams, DRBentley, JMBenwell, KRBickerdike, MJBodkin, CDCliffe, IADourish, CTGeorge, ARKennett, GAKnight, ARMalcolm, CSMansell, HLMisra, AQuirk, KRoffey, JRVickers, SP Pyrrolo(iso)quinoline derivatives as 5-HT(2C) receptor agonists. Bioorg Med Chem Lett 16:677-80 (2005)  
Target
Name:
5-hydroxytryptamine receptor 2C
Synonyms:
5-HT-1C 5-HT1C 5-HT2C-INI 5-HTR2C 5-hydroxytryptamine receptor 2C (5-HT-2C) 5HT-1C HTR1C Serotonin (5-HT3) receptor Serotonin Receptor 2C
Type:
G Protein-Coupled Receptor (GPCR)
Mol. Mass.:
51836.79
Organism:
Homo sapiens (Human)
Description:
P28335
Residue:
458
  
Inhibitor
Name:
BDBM50176274
Synonyms:
(S)-N-benzyl-1-(1H-pyrrolo[2,3-f]quinolin-1-yl)propan-2-amine | CHEMBL380763
Type:
Small organic molecule
Emp. Form.:
C21H21N3
Mol. Mass.:
315.4115
SMILES:
C[C@@H](Cn1ccc2ccc3ncccc3c12)NCc1ccccc1
: