Target
Lysophosphatidic acid receptor 3
Ligand
BDBM50176389
Substrate
Meas. Tech.
ChEMBL_333864 (CHEMBL865902)
IC50
251±n/a nM
Citation
 Durgam, GGTsukahara, RMakarova, NWalker, MDFujiwara, YPigg, KRBaker, DLSardar, VMParrill, ALTigyi, GMiller, DD Synthesis and pharmacological evaluation of second-generation phosphatidic acid derivatives as lysophosphatidic acid receptor ligands. Bioorg Med Chem Lett 16:633-40 (2005)  
Target
Name:
Lysophosphatidic acid receptor 3
Synonyms:
EDG7 LPAR3 Lysophosphatidic acid receptor 1/3 Lysophosphatidic acid receptor Edg-7
Type:
Enzyme
Mol. Mass.:
40149.72
Organism:
Homo sapiens (Human)
Description:
Q9UBY5
Residue:
353
  
Inhibitor
Name:
BDBM50176389
Synonyms:
CHEMBL440396 | thiophosphoric acid (S)-2-octanoylamino-2-octylcarbamoyl-ethyl ester
Type:
Small organic molecule
Emp. Form.:
C19H39N2O5PS
Mol. Mass.:
438.562
SMILES:
CCCCCCCCNC(=O)[C@H](COP(O)(O)=S)NC(=O)CCCCCCC
: