Target
Lysophosphatidic acid receptor 1
Ligand
BDBM50176392
Substrate
Meas. Tech.
ChEMBL_333862 (CHEMBL864091)
Ki
2850±n/a nM
Citation
 Durgam, GGTsukahara, RMakarova, NWalker, MDFujiwara, YPigg, KRBaker, DLSardar, VMParrill, ALTigyi, GMiller, DD Synthesis and pharmacological evaluation of second-generation phosphatidic acid derivatives as lysophosphatidic acid receptor ligands. Bioorg Med Chem Lett 16:633-40 (2005)  
Target
Name:
Lysophosphatidic acid receptor 1
Synonyms:
EDG2 LPA-1 LPAR1 Lysophosphatidic acid receptor 1 (LPA1) | Lysophosphatidic acid receptor Edg-2
Type:
Enzyme
Mol. Mass.:
41120.55
Organism:
Homo sapiens (Human)
Description:
Q92633
Residue:
364
  
Inhibitor
Name:
BDBM50176392
Synonyms:
CHEMBL379248 | thiophosphoric acid (R)-2-octanoylamino-2-octylcarbamoyl-ethyl ester
Type:
Small organic molecule
Emp. Form.:
C19H39N2O5PS
Mol. Mass.:
438.562
SMILES:
CCCCCCCCNC(=O)[C@@H](COP(O)(O)=S)NC(=O)CCCCCCC
: