Target
Lysophosphatidic acid receptor 3
Ligand
BDBM50176399
Substrate
Meas. Tech.
ChEMBL_333864 (CHEMBL865902)
EC50
115±n/a nM
Citation
 Durgam, GGTsukahara, RMakarova, NWalker, MDFujiwara, YPigg, KRBaker, DLSardar, VMParrill, ALTigyi, GMiller, DD Synthesis and pharmacological evaluation of second-generation phosphatidic acid derivatives as lysophosphatidic acid receptor ligands. Bioorg Med Chem Lett 16:633-40 (2005)  
Target
Name:
Lysophosphatidic acid receptor 3
Synonyms:
EDG7 LPAR3 Lysophosphatidic acid receptor 1/3 Lysophosphatidic acid receptor Edg-7
Type:
Enzyme
Mol. Mass.:
40149.72
Organism:
Homo sapiens (Human)
Description:
Q9UBY5
Residue:
353
  
Inhibitor
Name:
BDBM50176399
Synonyms:
CHEMBL202242 | octanoic acid (S)-2-octanoyloxy-3-thiophosphonooxy-propyl ester
Type:
Small organic molecule
Emp. Form.:
C19H37O7PS
Mol. Mass.:
440.532
SMILES:
CCCCCCCC(=O)OC[C@@H](COP(O)(O)=S)OC(=O)CCCCCCC
: