Target
Cannabinoid receptor 1
Ligand
BDBM29061
Substrate
Meas. Tech.
ChEMBL_333262 (CHEMBL859083)
Ki
1±n/a nM
Citation
 Carpino, PAGriffith, DASakya, SDow, RLBlack, SCHadcock, JRIredale, PAScott, DOFichtner, MWRose, CRDay, RDibrino, JButler, MDebartolo, DBDutcher, DGautreau, DLizano, JSO'connor, RESands, MAKelly-Sullivan, DWard, KM New bicyclic cannabinoid receptor-1 (CB1-R) antagonists. Bioorg Med Chem Lett 16:731-6 (2005)  
Target
Name:
Cannabinoid receptor 1
Synonyms:
CANN6 CB-R CNR CNR1_HUMAN Cannabinoid receptor Cannabinoid receptor 1 (brain)
Type:
G Protein-Coupled Receptor (GPCR)
Mol. Mass.:
52868.96
Organism:
Homo sapiens (Human)
Description:
P21554
Residue:
472
  
Inhibitor
Name:
BDBM29061
Synonyms:
CHEMBL201602 | pyrazolopyrimidinone-based antagonist, 3
Type:
Emp. Form.:
C20H13Cl2F3N4O
Mol. Mass.:
453.245
SMILES:
Cc1nc2c(-c3ccc(Cl)cc3)n(nc2c(=O)n1CC(F)(F)F)-c1ccccc1Cl
: