Target
D(3) dopamine receptor
Ligand
BDBM50176444
Substrate
Meas. Tech.
ChEMBL_332996 (CHEMBL853593)
Ki
93.8±n/a nM
Citation
 Geneste, HBackfisch, GBraje, WDelzer, JHaupt, AHutchins, CWKing, LLLubisch, WSteiner, GTeschendorf, HJUnger, LWernet, W Synthesis and SAR of highly potent and selective dopamine D(3)-receptor antagonists: Quinolin(di)one and benzazepin(di)one derivatives. herve.geneste@abbott.com. Bioorg Med Chem Lett 16:658-62 (2005)  
Target
Name:
D(3) dopamine receptor
Synonyms:
DOPAMINE D3 DRD3_HUMAN Dopamine D3 receptor (D3) Dopamine receptor Dopamine receptor D3
Type:
Mol. Mass.:
44243.43
Organism:
Homo sapiens (Human)
Description:
Residue:
400
  
Inhibitor
Name:
BDBM50176444
Synonyms:
1-(3-(4-(2-tert-butyl-6-(trifluoromethyl)pyrimidin-4-yl)piperazin-1-yl)propyl)-3,4-dihydroquinolin-2(1H)-one | CHEMBL201742
Type:
Small organic molecule
Emp. Form.:
C25H32F3N5O
Mol. Mass.:
475.5497
SMILES:
CC(C)(C)c1nc(cc(n1)C(F)(F)F)N1CCN(CCCN2C(=O)CCc3ccccc23)CC1
: