Target
Prostaglandin G/H synthase 1
Ligand
BDBM50176547
Substrate
Meas. Tech.
ChEMBL_327426 (CHEMBL863476)
IC50
3400±n/a nM
Citation
 Sakya, SMDeMello, KMMinich, MLRast, BShavnya, ARafka, RJKoss, DACheng, HLi, JJaynes, BHZiegler, CBMann, DWPetras, CFSeibel, SBSilvia, AMGeorge, DMLund, LASt Denis, SHickman, AHaven, MLLynch, MP 5-heteroatom substituted pyrazoles as canine COX-2 inhibitors. Part 1: Structure-activity relationship studies of 5-alkylamino pyrazoles and discovery of a potent, selective, and orally active analog. Bioorg Med Chem Lett 16:288-92 (2005)  
Target
Name:
Prostaglandin G/H synthase 1
Synonyms:
COX1 PGH synthase 1 PGHS-1 PTGS1 Prostaglandin H2 synthase 1 | Prostaglandin-endoperoxide synthase 1
Type:
PROTEIN
Mol. Mass.:
69314.28
Organism:
Canis familiaris
Description:
ChEMBL_327426
Residue:
603
  
Inhibitor
Name:
BDBM50176547
Synonyms:
5-(3-methylbutan-2-ylamino)-1-(5-(methylsulfonyl)pyridin-2-yl)-3-(trifluoromethyl)-1H-pyrazole-4-carbonitrile | CHEMBL199431
Type:
Small organic molecule
Emp. Form.:
C16H18F3N5O2S
Mol. Mass.:
401.407
SMILES:
CC(C)C(C)Nc1c(C#N)c(nn1-c1ccc(cn1)S(C)(=O)=O)C(F)(F)F
: