Target
Adenosine receptor A2b
Ligand
BDBM50176768
Substrate
Meas. Tech.
ChEMBL_327523 (CHEMBL871361)
Ki
38±n/a nM
Citation
 Elzein, EKalla, RLi, XPerry, TParkhill, EPalle, VVarkhedkar, VGimbel, AZeng, DLustig, DLeung, KZablocki, J Novel 1,3-dipropyl-8-(1-heteroarylmethyl-1H-pyrazol-4-yl)-xanthine derivatives as high affinity and selective A2B adenosine receptor antagonists. Bioorg Med Chem Lett 16:302-6 (2005)  
Target
Name:
Adenosine receptor A2b
Synonyms:
AA2BR_HUMAN ADORA2B Adenosine receptors A2b | Adenosine receptors; A2a & A2b
Type:
G Protein-Coupled Receptor (GPCR)
Mol. Mass.:
36341.22
Organism:
Homo sapiens (Human)
Description:
Residue:
332
  
Inhibitor
Name:
BDBM50176768
Synonyms:
8-(1-((5-(2-chlorophenyl)-1,2,4-oxadiazol-3-yl)methyl)-1H-pyrazol-4-yl)-1,3-dipropyl-1H-purine-2,6(3H,7H)-dione | CHEMBL199732
Type:
Small organic molecule
Emp. Form.:
C23H23ClN8O3
Mol. Mass.:
494.934
SMILES:
CCCn1c2nc([nH]c2c(=O)n(CCC)c1=O)-c1cnn(Cc2noc(n2)-c2ccccc2Cl)c1
: