Target
Cannabinoid receptor 2
Ligand
BDBM50176978
Substrate
Meas. Tech.
ChEMBL_430952 (CHEMBL914894)
Ki
18.1±n/a nM
Citation
 Murineddu, GRuiu, SLoriga, GManca, ILazzari, PReali, RPani, LToma, LPinna, GA Tricyclic pyrazoles. 3. Synthesis, biological evaluation, and molecular modeling of analogues of the cannabinoid antagonist 8-chloro-1-(2',4'-dichlorophenyl)-N-piperidin-1-yl-1,4,5,6-tetrahydrobenzo[6,7]cyclohepta[1,2-c]pyrazole-3-carboxamide. J Med Chem 48:7351-62 (2005)  
Target
Name:
Cannabinoid receptor 2
Synonyms:
CANNABINOID CB2 CB2 Cannabinoid CB2 receptor Cannabinoid receptor 2 mCB2
Type:
Enzyme Catalytic Domain
Mol. Mass.:
38220.43
Organism:
MOUSE
Description:
P47936
Residue:
347
  
Inhibitor
Name:
BDBM50176978
Synonyms:
1-(2',4'-dichlorophenyl)-N-piperidin-1-yl-1,4,5,6-tetrahydrobenzo[6,7]cyclohepta[1,2-c]pyrazole-3-carboxamide | CHEMBL389669
Type:
Small organic molecule
Emp. Form.:
C24H24Cl2N4O
Mol. Mass.:
455.38
SMILES:
Clc1ccc(c(Cl)c1)-n1nc(C(=O)NN2CCCCC2)c2CCCc3ccccc3-c12
: