Target
Receptor-type tyrosine-protein phosphatase C
Ligand
BDBM50177316
Substrate
Meas. Tech.
ChEMBL_331862 (CHEMBL865880)
IC50
1230±n/a nM
Citation
 Cho, SYBaek, JYHan, SSKang, SKHa, JDAhn, JHLee, JDKim, KRCheon, HGRhee, SDYang, SDYon, GHPak, CSChoi, JK PTP-1B inhibitors: cyclopenta[d][1,2]-oxazine derivatives. Bioorg Med Chem Lett 16:499-502 (2005)  
Target
Name:
Receptor-type tyrosine-protein phosphatase C
Synonyms:
CD45 L-CA PTPRC Receptor-type tyrosine-protein phosphatase C (CD45) | T200
Type:
Protein
Mol. Mass.:
147474.19
Organism:
Homo sapiens (Human)
Description:
P08575
Residue:
1306
  
Inhibitor
Name:
BDBM50177316
Synonyms:
2-(4-(7-(4-(aminomethyl)benzoyl)cyclopenta[d][1,2]oxazin-4-yl)phenoxy)acetic acid | CHEMBL202197
Type:
Small organic molecule
Emp. Form.:
C23H18N2O5
Mol. Mass.:
402.3994
SMILES:
NCc1ccc(cc1)C(=O)c1ccc2c(nocc12)-c1ccc(OCC(O)=O)cc1
: