Target
4-aminobutyrate aminotransferase, mitochondrial
Ligand
BDBM50177402
Substrate
Meas. Tech.
ChEMBL_332431 (CHEMBL867027)
IC50
176000±n/a nM
Citation
 Tao, YHYuan, ZTang, XQXu, HBYang, XL Inhibition of GABA shunt enzymes' activity by 4-hydroxybenzaldehyde derivatives. Bioorg Med Chem Lett 16:592-5 (2005)  
Target
Name:
4-aminobutyrate aminotransferase, mitochondrial
Synonyms:
(S)-3-amino-2-methylpropionate transaminase ABAT GABA transaminase GABA-T GABT_HUMAN L-AIBAT
Type:
PROTEIN
Mol. Mass.:
56449.39
Organism:
Homo sapiens (Human)
Description:
ChEMBL_1459248
Residue:
500
  
Inhibitor
Name:
BDBM50177402
Synonyms:
1-(4-hydroxy-phenyl)-propan-1-one 4'-Hydroxypropiophenone Paroxypropione
Type:
Small organic molecule
Emp. Form.:
C9H10O2
Mol. Mass.:
150.1745
SMILES:
CCC(=O)c1ccc(O)cc1
: