Target
Pro-cathepsin H
Ligand
BDBM50148298
Substrate
Meas. Tech.
ChEMBL_334150 (CHEMBL868301)
IC50
18±n/a nM
Citation
 Adkison, KKBarrett, DGDeaton, DNGampe, RTHassell, AMLong, STMcFadyen, RBMiller, ABMiller, LRPayne, JAShewchuk, LMWells-Knecht, KJWillard, DHWright, LL Semicarbazone-based inhibitors of cathepsin K, are they prodrugs for aldehyde inhibitors? Bioorg Med Chem Lett 16:978-83 (2006)  
Target
Name:
Pro-cathepsin H
Synonyms:
CATH_HUMAN CPSB Cathepsin H Cathepsin H light chain | Cathepsin H mini chain
Type:
PROTEIN
Mol. Mass.:
37402.31
Organism:
Homo sapiens (Human)
Description:
ChEMBL_1459870
Residue:
335
  
Inhibitor
Name:
BDBM50148298
Synonyms:
((S)-1-Formyl-pentyl)-carbamic acid (R)-1-benzyl-2-methyl-propyl ester (R)-3-methyl-1-phenylbutan-2-yl (S)-1-oxohexan-2-ylcarbamate | CHEMBL113948
Type:
Small organic molecule
Emp. Form.:
C18H27NO3
Mol. Mass.:
305.4119
SMILES:
CCCC[C@H](NC(=O)O[C@H](Cc1ccccc1)C(C)C)C=O
: