Target
Cathepsin K
Ligand
BDBM50177511
Substrate
Meas. Tech.
ChEMBL_334148 (CHEMBL868299)
IC50
40±n/a nM
Citation
 Adkison, KKBarrett, DGDeaton, DNGampe, RTHassell, AMLong, STMcFadyen, RBMiller, ABMiller, LRPayne, JAShewchuk, LMWells-Knecht, KJWillard, DHWright, LL Semicarbazone-based inhibitors of cathepsin K, are they prodrugs for aldehyde inhibitors? Bioorg Med Chem Lett 16:978-83 (2006)  
Target
Name:
Cathepsin K
Synonyms:
CATK_HUMAN CTSO Cathepsin O Cathepsin X
Type:
Enzyme
Mol. Mass.:
36975.68
Organism:
Homo sapiens (Human)
Description:
P43235
Residue:
329
  
Inhibitor
Name:
BDBM50177511
Synonyms:
CHEMBL204102 | tert-butyl N-[(1E,2S)-1-{[(diethylcarbamoyl)amino]imino}hexan-2-yl]carbamate
Type:
Small organic molecule
Emp. Form.:
C16H32N4O3
Mol. Mass.:
328.4503
SMILES:
CCCC[C@H](NC(=O)OC(C)(C)C)C=NNC(=O)N(CC)CC
: