Target
Integrin alpha-V/beta-6
Ligand
BDBM50177616
Substrate
Meas. Tech.
ChEMBL_334211 (CHEMBL866446)
IC50
4360±n/a nM
Citation
 Boys, MLSchretzman, LAChandrakumar, NSTollefson, MBMohler, SBDowns, VLPenning, TDRussell, MAWendt, JAChen, BBStenmark, HGWu, HSpangler, DPClare, MDesai, BNKhanna, IKNguyen, MNDuffin, TEngleman, VWFinn, MBFreeman, SKHanneke, MLKeene, JLKlover, JANickols, GANickols, MASteininger, CNWestlin, MWestlin, WYu, YXWang, YDalton, CRNorring, SA Convergent, parallel synthesis of a series of beta-substituted 1,2,4-oxadiazole butanoic acids as potent and selective alpha(v)beta3 receptor antagonists. Bioorg Med Chem Lett 16:839-44 (2006)  
Target
Name:
Integrin alpha-V/beta-6
Synonyms:
ITGAV/ITGB6 Integrin alpha-v/beata-6 Integrin beta-6/Vitronectin receptor alpha
Type:
Enzyme
Mol. Mass.:
Description:
Components:
This complex has 2 components.
Component 1
Name:
Integrin alpha-V
Synonyms:
ITAV_HUMAN Integrin alpha-V/alpha-5 VNRA Vitronectin receptor | Vitronectin receptor subunit alpha
Type:
PROTEIN
Mol. Mass.:
116024.92
Organism:
Homo sapiens (Human)
Description:
ChEMBL_582336
Residue:
1048
  
Component 2
Name:
Integrin beta-6
Synonyms:
ITB6_HUMAN | ITGB6
Type:
PROTEIN
Mol. Mass.:
85919.61
Organism:
Homo sapiens (Human)
Description:
EBI_10916
Residue:
788
  
Inhibitor
Name:
BDBM50177616
Synonyms:
(S)-3-(benzo[d][1,3]dioxol-5-yl)-4-(3-(4-(4-morpholinopyridin-2-ylamino)butyl)-1,2,4-oxadiazol-5-yl)butanoic acid | CHEMBL202081
Type:
Small organic molecule
Emp. Form.:
C26H31N5O6
Mol. Mass.:
509.5542
SMILES:
OC(=O)C[C@H](Cc1nc(CCCCNc2cc(ccn2)N2CCOCC2)no1)c1ccc2OCOc2c1
: