Target
5-hydroxytryptamine receptor 1A
Ligand
BDBM50130157
Substrate
Meas. Tech.
ChEMBL_349600 (CHEMBL866277)
Ki
3.09±n/a nM
Citation
 Takeuchi, KKohn, TJHonigschmidt, NARocco, VPSpinazze, PGHemrick-Luecke, SKThompson, LKEvans, DCRasmussen, KKoger, DLodge, DMartin, LJShaw, JThrelkeld, PGWong, DT Advances toward new antidepressants beyond SSRIs: 1-aryloxy-3-piperidinylpropan-2-ols with dual 5-HT1A receptor antagonism/SSRI activities. Part 5. Bioorg Med Chem Lett 16:2347-51 (2006)  
Target
Name:
5-hydroxytryptamine receptor 1A
Synonyms:
5-HT-1A 5-hydroxytryptamine receptor 1A (5-HT-1A) ADRB2RL1 Dopamine D2 receptor and serotonin 1a receptor HTR1A | Serotonin receptor 1A
Type:
Mol. Mass.:
46122.49
Organism:
Homo sapiens (Human)
Description:
Residue:
422
  
Inhibitor
Name:
BDBM50130157
Synonyms:
(S)-1-((4S,6R)-4-Benzo[b]thiophen-2-yl-2-methyl-piperidin-1-yl)-3-(1H-indol-4-yloxy)-propan-2-ol CHEMBL311701
Type:
Small organic molecule
Emp. Form.:
C25H28N2O2S
Mol. Mass.:
420.567
SMILES:
C[C@H]1C[C@@H](CCN1C[C@H](O)COc1cccc2[nH]ccc12)c1cc2ccccc2s1
: