Target
Sodium-dependent serotonin transporter
Ligand
BDBM50130157
Substrate
Meas. Tech.
ChEMBL_349601 (CHEMBL866278)
Ki
0.51±n/a nM
Citation
 Takeuchi, KKohn, TJHonigschmidt, NARocco, VPSpinazze, PGHemrick-Luecke, SKThompson, LKEvans, DCRasmussen, KKoger, DLodge, DMartin, LJShaw, JThrelkeld, PGWong, DT Advances toward new antidepressants beyond SSRIs: 1-aryloxy-3-piperidinylpropan-2-ols with dual 5-HT1A receptor antagonism/SSRI activities. Part 5. Bioorg Med Chem Lett 16:2347-51 (2006)  
Target
Name:
Sodium-dependent serotonin transporter
Synonyms:
5-HT Transporter 5HTT SC6A4_HUMAN SLC6A4 Serotonin transporter (5HTT) Sodium-dependent serotonin transporter (SERT) | Solute carrier family 6 member 4
Type:
Multi-pass membrane protein
Mol. Mass.:
70322.51
Organism:
Homo sapiens (Human)
Description:
P31645
Residue:
630
  
Inhibitor
Name:
BDBM50130157
Synonyms:
(S)-1-((4S,6R)-4-Benzo[b]thiophen-2-yl-2-methyl-piperidin-1-yl)-3-(1H-indol-4-yloxy)-propan-2-ol CHEMBL311701
Type:
Small organic molecule
Emp. Form.:
C25H28N2O2S
Mol. Mass.:
420.567
SMILES:
C[C@H]1C[C@@H](CCN1C[C@H](O)COc1cccc2[nH]ccc12)c1cc2ccccc2s1
: