Target
Sodium-dependent serotonin transporter
Ligand
BDBM50128380
Substrate
Meas. Tech.
ChEMBL_349601 (CHEMBL866278)
Ki
16.75±n/a nM
Citation
 Takeuchi, KKohn, TJHonigschmidt, NARocco, VPSpinazze, PGHemrick-Luecke, SKThompson, LKEvans, DCRasmussen, KKoger, DLodge, DMartin, LJShaw, JThrelkeld, PGWong, DT Advances toward new antidepressants beyond SSRIs: 1-aryloxy-3-piperidinylpropan-2-ols with dual 5-HT1A receptor antagonism/SSRI activities. Part 5. Bioorg Med Chem Lett 16:2347-51 (2006)  
Target
Name:
Sodium-dependent serotonin transporter
Synonyms:
5-HT Transporter 5HTT SC6A4_HUMAN SLC6A4 Serotonin transporter (5HTT) Sodium-dependent serotonin transporter (SERT) | Solute carrier family 6 member 4
Type:
Multi-pass membrane protein
Mol. Mass.:
70322.51
Organism:
Homo sapiens (Human)
Description:
P31645
Residue:
630
  
Inhibitor
Name:
BDBM50128380
Synonyms:
(S)-1-(1H-indol-4-yloxy)-3-(4-(benzo[b]thiophen-2-yl)piperidin-1-yl)propan-2-ol CHEMBL300115
Type:
Small organic molecule
Emp. Form.:
C24H26N2O2S
Mol. Mass.:
406.54
SMILES:
O[C@H](COc1cccc2[nH]ccc12)CN1CCC(CC1)c1cc2ccccc2s1
: