Target
Sodium-dependent dopamine transporter
Ligand
BDBM50177768
Substrate
Meas. Tech.
ChEMBL_326505 (CHEMBL864472)
Ki
436±n/a nM
Citation
 Cha, JHZou, MFAdkins, EMRasmussen, SGLoland, CJSchoenenberger, BGether, UNewman, AH Rhodamine-labeled 2beta-carbomethoxy-3beta-(3,4-dichlorophenyl)tropane analogues as high-affinity fluorescent probes for the dopamine transporter. J Med Chem 48:7513-6 (2005)  
Target
Name:
Sodium-dependent dopamine transporter
Synonyms:
DA transporter DAT1 Dopamine transporter protein (DAT) SC6A3_HUMAN Sodium-dependent dopamine transporter Solute carrier family 6 member 3
Type:
Multi-pass membrane protein
Mol. Mass.:
68497.11
Organism:
Homo sapiens (Human)
Description:
Q01959
Residue:
620
  
Inhibitor
Name:
BDBM50177768
Synonyms:
2-(3-sec-Butylimino-6-diethylamino-3H-xanthen-9-yl)-5-[(4-{2-[3-(3,4-dichloro-phenyl)-2-methoxycarbonyl-8-aza-bicyclo[3.2.1]oct-8-yl]-ethylcarbamoyl}-cyclohexylmethyl)-sulfamoyl]-benzenesulfonic acid anion | CHEMBL216773
Type:
Small organic molecule
Emp. Form.:
C52H63Cl2N5O9S2
Mol. Mass.:
1037.121
SMILES:
CCN(CC)c1ccc2c(-c3ccc(cc3S([O-])(=O)=O)S(=O)(=O)NC[C@H]3CC[C@@H](CC3)C(=O)NCCN3C4CCC3[C@H]([C@H](C4)c3ccc(Cl)c(Cl)c3)C(=O)OC)c3ccc(cc3oc2c1)=[N+](CC)CC
: