Target
Vascular endothelial growth factor receptor 2
Ligand
BDBM50177836
Substrate
Meas. Tech.
ChEMBL_326138 (CHEMBL864514)
IC50
1.7±n/a nM
Citation
 Wissner, AFloyd, MBJohnson, BDFraser, HIngalls, CNittoli, TDushin, RGDiscafani, CNilakantan, RMarini, JRavi, MCheung, KTan, XMusto, SAnnable, TSiegel, MMLoganzo, F 2-(Quinazolin-4-ylamino)-[1,4]benzoquinones as covalent-binding, irreversible inhibitors of the kinase domain of vascular endothelial growth factor receptor-2. J Med Chem 48:7560-81 (2005)  
Target
Name:
Vascular endothelial growth factor receptor 2
Synonyms:
CD_antigen=CD309 Fetal liver kinase 1 (FLK-1) KDR Protein-tyrosine kinase receptor Flk-1 VEGFR-2 VEGFR2 Vascular Endothelial Growth Factor Receptor Kinase 2 Vascular endothelial growth factor receptor 2 (KDR) Vascular endothelial growth factor receptor 2 (VEGFR2) Vascular endothelial growth factor receptor-2 (VEGFR-2)
Type:
Receptor Tyrosine Kinase
Mol. Mass.:
151510.97
Organism:
Homo sapiens (Human)
Description:
P35968
Residue:
1356
  
Inhibitor
Name:
BDBM50177836
Synonyms:
2-{[6-Methoxy-7-(2-methoxyethoxy)quinazolin-4-yl]amino}-5-(2-phenoxyethoxy)benzo-1,4-quinone | CHEMBL200324
Type:
Small organic molecule
Emp. Form.:
C26H25N3O7
Mol. Mass.:
491.4926
SMILES:
COCCOc1cc2ncnc(N=C3CC(=O)C(OCCOc4ccccc4)=CC3=O)c2cc1OC
: