Target
Dynamin-1
Ligand
BDBM50177911
Substrate
Meas. Tech.
ChEMBL_326472 (CHEMBL864467)
IC50
>100000±n/a nM
Citation
 Hill, TOdell, LREdwards, JKGraham, MEMcGeachie, ABRusak, JQuan, AAbagyan, RScott, JLRobinson, PJMcCluskey, A Small molecule inhibitors of dynamin I GTPase activity: development of dimeric tyrphostins. J Med Chem 48:7781-8 (2005)  
Target
Name:
Dynamin-1
Synonyms:
DNM DYN1_HUMAN | Dynamin-1
Type:
PROTEIN
Mol. Mass.:
97411.67
Organism:
Homo sapiens (Human)
Description:
ChEMBL_1458576
Residue:
864
  
Inhibitor
Name:
BDBM50177911
Synonyms:
2-cyano-N-{6-[2-cyano-3-(4-carboxyphenyl)acryloylamino]hexyl}-3-(4-carboxyphenyl)acrylamide | CHEMBL199213
Type:
Small organic molecule
Emp. Form.:
C28H26N4O6
Mol. Mass.:
514.5292
SMILES:
OC(=O)c1ccc(\C=C(/C#N)C(=O)NCCCCCCNC(=O)C(=C\c2ccc(cc2)C(O)=O)\C#N)cc1
: