Target
Dynamin-1
Ligand
BDBM50177927
Substrate
Meas. Tech.
ChEMBL_326472 (CHEMBL864467)
IC50
>100000±n/a nM
Citation
 Hill, TOdell, LREdwards, JKGraham, MEMcGeachie, ABRusak, JQuan, AAbagyan, RScott, JLRobinson, PJMcCluskey, A Small molecule inhibitors of dynamin I GTPase activity: development of dimeric tyrphostins. J Med Chem 48:7781-8 (2005)  
Target
Name:
Dynamin-1
Synonyms:
DNM DYN1_HUMAN | Dynamin-1
Type:
PROTEIN
Mol. Mass.:
97411.67
Organism:
Homo sapiens (Human)
Description:
ChEMBL_1458576
Residue:
864
  
Inhibitor
Name:
BDBM50177927
Synonyms:
2-cyano-N-{4-[2-cyano-3-(4-hydroxyphenyl)acryloylamino]butyl}-3-(4-hydroxyphenyl)acrylamide | CHEMBL198793
Type:
Small organic molecule
Emp. Form.:
C24H22N4O4
Mol. Mass.:
430.4559
SMILES:
Oc1ccc(\C=C(/C#N)C(=O)NCCCCNC(=O)C(=C\c2ccc(O)cc2)\C#N)cc1
: