Target
Dynamin-1
Ligand
BDBM50177930
Substrate
Meas. Tech.
ChEMBL_326472 (CHEMBL864467)
IC50
80000±n/a nM
Citation
 Hill, TOdell, LREdwards, JKGraham, MEMcGeachie, ABRusak, JQuan, AAbagyan, RScott, JLRobinson, PJMcCluskey, A Small molecule inhibitors of dynamin I GTPase activity: development of dimeric tyrphostins. J Med Chem 48:7781-8 (2005)  
Target
Name:
Dynamin-1
Synonyms:
DNM DYN1_HUMAN | Dynamin-1
Type:
PROTEIN
Mol. Mass.:
97411.67
Organism:
Homo sapiens (Human)
Description:
ChEMBL_1458576
Residue:
864
  
Inhibitor
Name:
BDBM50177930
Synonyms:
2-cyano-N-{3-[2-cyano-3-(3,4-dihydroxy-5-methoxyphenyl)acryloylamino]hexyl}-3-(3,4-dihydroxy-5-methoxyphenyl)acrylamide | CHEMBL371102
Type:
Small organic molecule
Emp. Form.:
C28H30N4O8
Mol. Mass.:
550.5598
SMILES:
COc1cc(\C=C(/C#N)C(=O)NCCCCCCNC(=O)C(=C\c2cc(O)c(O)c(OC)c2)\C#N)cc(O)c1O
: