Target
Dynamin-1
Ligand
BDBM50177962
Substrate
Meas. Tech.
ChEMBL_326472 (CHEMBL864467)
IC50
>100000±n/a nM
Citation
 Hill, TOdell, LREdwards, JKGraham, MEMcGeachie, ABRusak, JQuan, AAbagyan, RScott, JLRobinson, PJMcCluskey, A Small molecule inhibitors of dynamin I GTPase activity: development of dimeric tyrphostins. J Med Chem 48:7781-8 (2005)  
Target
Name:
Dynamin-1
Synonyms:
DNM DYN1_HUMAN | Dynamin-1
Type:
PROTEIN
Mol. Mass.:
97411.67
Organism:
Homo sapiens (Human)
Description:
ChEMBL_1458576
Residue:
864
  
Inhibitor
Name:
BDBM50177962
Synonyms:
3-(4-chlorophenyl)-N-{6-[3-(4-chlorophenyl)-2-cyanoacryloylamino]hexyl}-2-cyanoacrylamide | CHEMBL371714
Type:
Small organic molecule
Emp. Form.:
C26H24Cl2N4O2
Mol. Mass.:
495.4
SMILES:
Clc1cccc(\C=C(/C#N)C(=O)NCCCCCCNC(=O)C(=C\c2cccc(Cl)c2)\C#N)c1
: