Target
Dynamin-1
Ligand
BDBM50177974
Substrate
Meas. Tech.
ChEMBL_326472 (CHEMBL864467)
IC50
>100000±n/a nM
Citation
 Hill, TOdell, LREdwards, JKGraham, MEMcGeachie, ABRusak, JQuan, AAbagyan, RScott, JLRobinson, PJMcCluskey, A Small molecule inhibitors of dynamin I GTPase activity: development of dimeric tyrphostins. J Med Chem 48:7781-8 (2005)  
Target
Name:
Dynamin-1
Synonyms:
DNM DYN1_HUMAN | Dynamin-1
Type:
PROTEIN
Mol. Mass.:
97411.67
Organism:
Homo sapiens (Human)
Description:
ChEMBL_1458576
Residue:
864
  
Inhibitor
Name:
BDBM50177974
Synonyms:
2-cyano-3-(3,4-dihydroxyphenyl)acrylic acid 2-[2-cyano-3-(3,4-dihydroxyphenyl)acryloyloxy-hexyl ester | CHEMBL425207
Type:
Small organic molecule
Emp. Form.:
C26H24N2O8
Mol. Mass.:
492.4774
SMILES:
Oc1ccc(\C=C(/C#N)C(=O)OCCCCCCOC(=O)C(=C\c2ccc(O)c(O)c2)\C#N)cc1O
: