Target
Potassium voltage-gated channel subfamily H member 2
Ligand
BDBM50178273
Substrate
Meas. Tech.
ChEMBL_332690 (CHEMBL858932)
Ki
190±n/a nM
Citation
 Thomson, CGCarlson, EChicchi, GGKulagowski, JJKurtz, MMSwain, CJTsao, KLWheeldon, A Synthesis and structure-activity relationships of 8-azabicyclo[3.2.1]octane benzylamine NK1 antagonists. Bioorg Med Chem Lett 16:811-4 (2006)  
Target
Name:
Potassium voltage-gated channel subfamily H member 2
Synonyms:
1,3-beta-glucan synthase component GLS2 ERG Eag-related protein 1 Ether-a-go-go-related gene (HERG) Ether-a-go-go-related gene potassium channel 1 Ether-a-go-go-related gene potassium channel 1 (hERG1) Ether-a-go-go-related protein 1 H-ERG KCNH2 Potassium voltage-gated channel subfamily H member 2 (hERG) Voltage-gated potassium channel subunit Kv11.1 hERG Potassium Channel 1 | putative potassium channel subunit
Type:
Multi-pass membrane protein
Mol. Mass.:
126672.65
Organism:
Homo sapiens (Human)
Description:
Q12809
Residue:
1159
  
Inhibitor
Name:
BDBM50178273
Synonyms:
CHEMBL202775 | N-((2-(2-cyclopropoxy-5-(trifluoromethoxy)benzylamino)-1-(4-fluorophenyl)-8-aza-bicyclo[3.2.1]octan-6-yl)methyl)benzenesulfonamide
Type:
Small organic molecule
Emp. Form.:
C31H33F4N3O4S
Mol. Mass.:
619.67
SMILES:
Fc1ccc(cc1)C12CC(CNS(=O)(=O)c3ccccc3)C(CCC1NCc1cc(OC(F)(F)F)ccc1OC1CC1)N2
: