Target
Voltage-dependent calcium channel subunit alpha-2/delta-1
Ligand
BDBM50178484
Substrate
Meas. Tech.
ChEMBL_332923 (CHEMBL854074)
IC50
67±n/a nM
Citation
 Chen, CStearns, BHu, TAnker, NSantini, AArruda, JMCampbell, BTDatta, PAiyar, JMunoz, B Expedited SAR study of high-affinity ligands to the alpha(2)delta subunit of voltage-gated calcium channels: Generation of a focused library using a solution-phase Sn2Ar coupling methodology. Bioorg Med Chem Lett 16:746-9 (2005)  
Target
Name:
Voltage-dependent calcium channel subunit alpha-2/delta-1
Synonyms:
CA2D1_HUMAN CACNL2A MHS3 Voltage-dependent calcium channel subunit delta-1 Voltage-gated calcium channel alpha2/delta subunit 1 | Voltage-gated calcium channel subunit alpha-2/delta-1
Type:
Enzyme
Mol. Mass.:
124544.88
Organism:
Homo sapiens (Human)
Description:
P54289
Residue:
1103
  
Inhibitor
Name:
BDBM50178484
Synonyms:
6-(4-ethoxyphenyl)-N-isopropyl-4,5,7-trimethyl-6H-pyrrolo[3,4-d]pyridazin-1-amine | CHEMBL202058
Type:
Small organic molecule
Emp. Form.:
C20H26N4O
Mol. Mass.:
338.4466
SMILES:
CCOc1ccc(cc1)-n1c(C)c2c(C)nnc(NC(C)C)c2c1C
: