Target
Excitatory amino acid transporter 3
Ligand
BDBM50178683
Substrate
Meas. Tech.
ChEMBL_326370 (CHEMBL859749)
Ki
51000±n/a nM
Citation
 Alaux, SKusk, MSagot, EBolte, JJensen, AABräuner-Osborne, HGefflaut, TBunch, L Chemoenzymatic synthesis of a series of 4-substituted glutamate analogues and pharmacological characterization at human glutamate transporters subtypes 1-3. J Med Chem 48:7980-92 (2005)  
Target
Name:
Excitatory amino acid transporter 3
Synonyms:
EAA3_HUMAN EAAT3 HEAAC1 | SLC1A1
Type:
Enzyme Catalytic Domain
Mol. Mass.:
57096.71
Organism:
Homo sapiens (Human)
Description:
Excitatory Amino Acid EAAT3 0 HUMAN::P43005
Residue:
524
  
Inhibitor
Name:
BDBM50178683
Synonyms:
(2S,4S)-4-isopropylglutamic acid | CHEMBL199564
Type:
Small organic molecule
Emp. Form.:
C8H15NO4
Mol. Mass.:
189.209
SMILES:
CC(C)[C@H](C[C@H](N)C(O)=O)C(O)=O
: