Target
Catechol O-methyltransferase
Ligand
BDBM50178793
Substrate
Meas. Tech.
ChEMBL_325427 (CHEMBL858657)
IC50
130±n/a nM
Citation
 Learmonth, DABonifácio, MJSoares-da-Silva, P Synthesis and biological evaluation of a novel series of"ortho-nitrated" inhibitors of catechol-O-methyltransferase. J Med Chem 48:8070-8 (2005)  
Target
Name:
Catechol O-methyltransferase
Synonyms:
COMT_RAT Catechol-O-methyltransferase | Comt
Type:
Enzyme
Mol. Mass.:
29594.09
Organism:
Rattus norvegicus (Rat)
Description:
Residue:
264
  
Inhibitor
Name:
BDBM50178793
Synonyms:
1-(3,4-dihydroxy-2-nitrophenyl)-2-phenylethanone | CHEMBL197115
Type:
Small organic molecule
Emp. Form.:
C14H11NO5
Mol. Mass.:
273.2408
SMILES:
Oc1ccc(C(=O)Cc2ccccc2)c(c1O)[N+]([O-])=O
: