Target
Mitogen-activated protein kinase 10
Ligand
BDBM50178827
Substrate
Meas. Tech.
ChEMBL_339825 (CHEMBL862176)
IC50
3.00±n/a nM
Citation
 Swahn, BMXue, YArzel, EKallin, EMagnus, APlobeck, NViklund, J Design and synthesis of 2'-anilino-4,4'-bipyridines as selective inhibitors of c-Jun N-terminal kinase-3. Bioorg Med Chem Lett 16:1397-401 (2006)  
Target
Name:
Mitogen-activated protein kinase 10
Synonyms:
JNK3 MAP kinase p49 3F12 MK10_HUMAN Mitogen-activated protein kinase 10 (Stress-activated protein kinase JNK3) (c-Jun N-terminal kinase 3) (MAP kinase p49 3F12) PRKM10 Stress-activated protein kinase JNK3 | c-Jun N-terminal kinase 3 (JNK3)
Type:
Enzyme
Mol. Mass.:
52586.89
Organism:
Homo sapiens (Human)
Description:
Residue:
464
  
Inhibitor
Name:
BDBM50178827
Synonyms:
(+)-N-(4-(2-(4-fluorophenylamino)pyridin-4-yl)pyridin-2-yl)-tetrahydrofuran-3-carboxamide CHEMBL203839
Type:
Small organic molecule
Emp. Form.:
C21H19FN4O2
Mol. Mass.:
378.3996
SMILES:
Fc1ccc(Nc2cc(ccn2)-c2ccnc(NC(=O)C3CCOC3)c2)cc1
: