Target
Sodium channel protein type 9 subunit alpha
Ligand
BDBM50178853
Substrate
Meas. Tech.
ChEMBL_337839 (CHEMBL866524)
Ki
440±n/a nM
Citation
 Ok, DLi, CAbbadie, CFelix, JPFisher, MHGarcia, MLKaczorowski, GJLyons, KAMartin, WJPriest, BTSmith, MMWilliams, BSWyvratt, MJParsons, WH Synthesis and SAR of 1,2-trans-(1-hydroxy-3-phenylprop-1-yl)cyclopentane carboxamide derivatives, a new class of sodium channel blockers. Bioorg Med Chem Lett 16:1358-61 (2006)  
Target
Name:
Sodium channel protein type 9 subunit alpha
Synonyms:
NENA Peripheral sodium channel 1 SCN9A_HUMAN Voltage-gated sodium channel subunit Nav1.7 hNE-Na
Type:
Protein
Mol. Mass.:
226375.97
Organism:
Homo sapiens (Human)
Description:
Q15858
Residue:
1988
  
Inhibitor
Name:
BDBM50178853
Synonyms:
CHEMBL206615 | trans-N-(3,5-dichlorobenzyl)-2-(1-hydroxy-3-(3-(trifluoromethoxy)phenyl)propyl)cyclopentanecarboxamide
Type:
Small organic molecule
Emp. Form.:
C23H24Cl2F3NO3
Mol. Mass.:
490.343
SMILES:
OC(CCc1cccc(OC(F)(F)F)c1)[C@@H]1CCC[C@H]1C(=O)NCc1cc(Cl)cc(Cl)c1
: