Target
DNA gyrase subunit A/B
Ligand
BDBM50178916
Substrate
Meas. Tech.
ChEMBL_340187 (CHEMBL863775)
IC50
900±n/a nM
Citation
 Wiles, JAWang, QLucien, EHashimoto, ASong, YCheng, JMarlor, CWOu, YPodos, SDThanassi, JAThoma, CLDeshpande, MPucci, MJBradbury, BJ Isothiazoloquinolones containing functionalized aromatic hydrocarbons at the 7-position: synthesis and in vitro activity of a series of potent antibacterial agents with diminished cytotoxicity in human cells. Bioorg Med Chem Lett 16:1272-6 (2006)  
Target
Name:
DNA gyrase subunit A/B
Synonyms:
DNA Gyrase | DNA gyrase A/B
Type:
A2B2 tetramer
Mol. Mass.:
Description:
Components:
This complex has 2 components.
Component 1
Name:
DNA gyrase subunit A
Synonyms:
DNA gyrase GYRA_ECOLI hisW parD
Type:
Enzyme Subunit
Mol. Mass.:
96935.15
Organism:
Escherichia coli (strain K12)
Description:
Residue:
875
  
Component 2
Name:
DNA gyrase subunit B
Synonyms:
DNA gyrase subunit B GYRB_ECOLI acrB gyrB hisU parA | pcbA
Type:
Enzyme Subunit
Mol. Mass.:
89941.28
Organism:
Escherichia coli (strain K12)
Description:
P0AES6
Residue:
804
  
Inhibitor
Name:
BDBM50178916
Synonyms:
9-cyclopropyl-6-fluoro-7-(4-(hydroxymethyl)phenyl)isothiazolo[5,4-b]quinoline-3,4(2H,9H)-dione | CHEMBL203002
Type:
Small organic molecule
Emp. Form.:
C20H15FN2O3S
Mol. Mass.:
382.408
SMILES:
OCc1ccc(cc1)-c1cc2n(C3CC3)c3s[nH]c(=O)c3c(=O)c2cc1F
: