Target
DNA topoisomerase 4 subunit A
Ligand
BDBM50178917
Substrate
Meas. Tech.
ChEMBL_340188 (CHEMBL864372)
IC50
300±n/a nM
Citation
 Wiles, JAWang, QLucien, EHashimoto, ASong, YCheng, JMarlor, CWOu, YPodos, SDThanassi, JAThoma, CLDeshpande, MPucci, MJBradbury, BJ Isothiazoloquinolones containing functionalized aromatic hydrocarbons at the 7-position: synthesis and in vitro activity of a series of potent antibacterial agents with diminished cytotoxicity in human cells. Bioorg Med Chem Lett 16:1272-6 (2006)  
Target
Name:
DNA topoisomerase 4 subunit A
Synonyms:
PARC_STAAU grlA | parC
Type:
PROTEIN
Mol. Mass.:
91040.14
Organism:
Staphylococcus aureus
Description:
ChEMBL_340188
Residue:
800
  
Inhibitor
Name:
BDBM50178917
Synonyms:
(S,Z)-7-(3-(aminomethyl)-4-(methoxyimino)pyrrolidin-1-yl)-1-cyclopropyl-6-fluoro-4-oxo-1,4-dihydro-1,8-naphthyridine-3-carboxylic acid 7-(3-(aminomethyl)-4-(methoxyimino)pyrrolidin-1-yl)-1-cyclopropyl-6-fluoro-4-oxo-1,4-dihydro-1,8-naphthyridine-3-carboxylic acid CHEMBL430 GEMIFLOXACIN
Type:
Small organic molecule
Emp. Form.:
C18H20FN5O4
Mol. Mass.:
389.3809
SMILES:
CO\N=C1/CN(CC1CN)c1nc2n(cc(C(O)=O)c(=O)c2cc1F)C1CC1
: