Target
Amine oxidase [flavin-containing] A
Ligand
BDBM50179017
Substrate
Meas. Tech.
ChEMBL_341082 (CHEMBL860628)
IC50
2.1±n/a nM
Citation
 Hassan, SYKhattab, SNBekhit, AAAmer, A Synthesis of 3-benzyl-2-substituted quinoxalines as novel monoamine oxidase A inhibitors. Bioorg Med Chem Lett 16:1753-6 (2006)  
Target
Name:
Amine oxidase [flavin-containing] A
Synonyms:
AOFA_RAT Amine oxidase [flavin-containing] A Monoamine Oxidase Type A (MAO-A) Monoamine oxidase A (MAO-A) Monoamine oxidase type A (MAOA)
Type:
Enzyme
Mol. Mass.:
59515.21
Organism:
Rattus norvegicus (rat)
Description:
Residue:
526
  
Inhibitor
Name:
BDBM50179017
Synonyms:
1-(3-(4-chlorobenzyl)quinoxalin-2-yl)hydrazine | CHEMBL381487
Type:
Small organic molecule
Emp. Form.:
C15H13ClN4
Mol. Mass.:
284.744
SMILES:
NNc1nc2ccccc2nc1Cc1ccc(Cl)cc1
: