Target
5-hydroxytryptamine receptor 2A
Ligand
BDBM50179080
Substrate
Meas. Tech.
ChEMBL_340092 (CHEMBL861242)
Ki
42±n/a nM
Citation
 Richter, HGAdams, DRBenardeau, ABickerdike, MJBentley, JMBlench, TJCliffe, IADourish, CHebeisen, PKennett, GAKnight, ARMalcolm, CSMattei, PMisra, AMizrahi, JMonck, NJPlancher, JMRoever, SRoffey, JRTaylor, SVickers, SP Synthesis and biological evaluation of novel hexahydro-pyrido[3',2':4,5]pyrrolo[1,2-a]pyrazines as potent and selective 5-HT(2C) receptor agonists. Bioorg Med Chem Lett 16:1207-11 (2006)  
Target
Name:
5-hydroxytryptamine receptor 2A
Synonyms:
5-HT-2 5-HT2A 5-hydroxytryptamine receptor 2A (5HT-2A) 5HT2A_HUMAN HTR2A | Serotonin receptor 2A
Type:
undefined
Mol. Mass.:
52607.65
Organism:
Homo sapiens (Human)
Description:
P28223
Residue:
471
  
Inhibitor
Name:
BDBM50179080
Synonyms:
(4R,9aR)-6-chloro-4-methyl-1,2,3,4,9,9a-hexahydro-2,4a,5-triaza-fluorene | CHEMBL203230
Type:
Small organic molecule
Emp. Form.:
C11H14ClN3
Mol. Mass.:
223.702
SMILES:
C[C@@H]1CNC[C@H]2Cc3ccc(Cl)nc3N12
: