Target
5-hydroxytryptamine receptor 2C
Ligand
BDBM50179086
Substrate
Meas. Tech.
ChEMBL_340094 (CHEMBL861244)
Ki
2.7±n/a nM
Citation
 Richter, HGAdams, DRBenardeau, ABickerdike, MJBentley, JMBlench, TJCliffe, IADourish, CHebeisen, PKennett, GAKnight, ARMalcolm, CSMattei, PMisra, AMizrahi, JMonck, NJPlancher, JMRoever, SRoffey, JRTaylor, SVickers, SP Synthesis and biological evaluation of novel hexahydro-pyrido[3',2':4,5]pyrrolo[1,2-a]pyrazines as potent and selective 5-HT(2C) receptor agonists. Bioorg Med Chem Lett 16:1207-11 (2006)  
Target
Name:
5-hydroxytryptamine receptor 2C
Synonyms:
5-HT-2C 5-HT2C-INI 5-HTR2C 5-hydroxytryptamine receptor 2C (5-HT-2C) 5HT-1C HTR1C Serotonin (5-HT3) receptor Serotonin Receptor 2C
Type:
G Protein-Coupled Receptor (GPCR)
Mol. Mass.:
51836.79
Organism:
Homo sapiens (Human)
Description:
P28335
Residue:
458
  
Inhibitor
Name:
BDBM50179086
Synonyms:
(4R,9aR)-4,6-dimethyl-1,2,3,4,9,9a-hexahydro-2,4a,5-triaza-fluorene | CHEMBL206845
Type:
Small organic molecule
Emp. Form.:
C12H17N3
Mol. Mass.:
203.2835
SMILES:
C[C@@H]1CNC[C@H]2Cc3ccc(C)nc3N12
: