Target
Vascular endothelial growth factor receptor 1
Ligand
BDBM50179146
Substrate
Meas. Tech.
ChEMBL_339232 (CHEMBL867220)
IC50
760±n/a nM
Citation
 Kiselyov, ASSemenova, MSemenov, VVPiatnitski, E 2-((1H-Azol-1-yl)methyl)-N-arylbenzamides: novel dual inhibitors of VEGFR-1/2 kinases. Bioorg Med Chem Lett 16:1726-30 (2006)  
Target
Name:
Vascular endothelial growth factor receptor 1
Synonyms:
FLT FRT Fms-like tyrosine kinase 1 Tyrosine-protein kinase FRT VEGFR-1 VGFR1_HUMAN Vascular endothelial growth factor receptor 1 (FLT1) Vascular endothelial growth factor receptor 1 and 2 (Flt-1 and KDR) Vascular permeability factor receptor vascular endothelial growth factor/vascular permeability factor receptor
Type:
Receptor Tyrosine Kinase
Mol. Mass.:
150800.23
Organism:
Homo sapiens (Human)
Description:
P17948
Residue:
1338
  
Inhibitor
Name:
BDBM50179146
Synonyms:
2-((1H-pyrrolo[3,2-c]pyridin-1-yl)methyl)-N-(4-tert-butylphenyl)benzamide | CHEMBL203965
Type:
Small organic molecule
Emp. Form.:
C25H25N3O
Mol. Mass.:
383.4855
SMILES:
CC(C)(C)c1ccc(NC(=O)c2ccccc2Cn2ccc3cnccc23)cc1
: