Target
17-beta-hydroxysteroid dehydrogenase type 1
Ligand
BDBM50179200
Substrate
Meas. Tech.
ChEMBL_325410 (CHEMBL858655)
IC50
120±n/a nM
Citation
 Poirier, DBoivin, RPTremblay, MRBérubé, MQiu, WLin, SX Estradiol-adenosine hybrid compounds designed to inhibit type 1 17beta-hydroxysteroid dehydrogenase. J Med Chem 48:8134-47 (2005)  
Target
Name:
17-beta-hydroxysteroid dehydrogenase type 1
Synonyms:
17-beta-HSD 1 17-beta-hydroxysteroid dehydrogenase type 1 20-alpha-HSD E17KSR EDH17B1 EDHB17 Estradiol 17-beta-dehydrogenase 1 (17beta-HSD1) Placental 17-beta-hydroxysteroid dehydrogenase | SDR28C1
Type:
Enzyme
Mol. Mass.:
34945.13
Organism:
Homo sapiens (Human)
Description:
P14061
Residue:
328
  
Inhibitor
Name:
BDBM50179200
Synonyms:
((2R,3S,4R,5R)-5-(6-amino-9H-purin-9-yl)-3,4-dihydroxytetrahydrofuran-2-yl)methyl 11-((8R,9S,13S,14S,16S,17S)-3,17-dihydroxy-13-methyl-7,8,9,11,12,13,14,15,16,17-decahydro-6H-cyclopenta[a]phenanthren-16-yl)undecanoate CHEMBL170583
Type:
Small organic molecule
Emp. Form.:
C39H55N5O7
Mol. Mass.:
705.8833
SMILES:
C[C@]12CC[C@H]3[C@@H](CCc4cc(O)ccc34)[C@@H]1C[C@H](CCCCCCCCCCC(=O)OC[C@H]1O[C@H]([C@H](O)[C@@H]1O)n1cnc3c(N)ncnc13)[C@@H]2O
: