Target
Platelet-derived growth factor receptor beta
Ligand
BDBM50179211
Substrate
Meas. Tech.
ChEMBL_325210 (CHEMBL861463)
IC50
5±n/a nM
Citation
 Ho, CYLudovici, DWMaharoof, USMei, JSechler, JLTuman, RWStrobel, EDAndraka, LYen, HKLeo, GLi, JAlmond, HLu, HDeVine, ATominovich, RMBaker, JEmanuel, SGruninger, RHMiddleton, SAJohnson, DLGalemmo, RA (6,7-Dimethoxy-2,4-dihydroindeno[1,2-c]pyrazol-3-yl)phenylamines: platelet-derived growth factor receptor tyrosine kinase inhibitors with broad antiproliferative activity against tumor cells. J Med Chem 48:8163-73 (2005)  
Target
Name:
Platelet-derived growth factor receptor beta
Synonyms:
Beta-type platelet-derived growth factor receptor CD140b antigen PDGF Receptor Substrate PDGFR PDGFR-1 PDGFRB PGFRB_HUMAN Platelet-derived growth factor receptor 1 Platelet-derived growth factor receptor beta (PDGFR-beta) Platelet-derived growth factor receptor beta (PDGFRbeta) | VHL/PDGFRB
Type:
Enzyme
Mol. Mass.:
123922.25
Organism:
Homo sapiens (Human)
Description:
P09619
Residue:
1106
  
Inhibitor
Name:
BDBM50179211
Synonyms:
3-bromo-N-(6,7-dimethoxy-2,4-dihydroindeno[1,2-c]pyrazol-3-yl)phenylamine | CHEMBL120862
Type:
Small organic molecule
Emp. Form.:
C18H16BrN3O2
Mol. Mass.:
386.243
SMILES:
COc1cc2Cc3c(Nc4cccc(Br)c4)[nH]nc3-c2cc1OC
: